Error while building in Fedora 19
  • Hi,

    I got the below error while building guayadeque to install it. How to fix it?

    [ 83%] Building CXX object src/CMakeFiles/guayadeque.dir/wxsqlite3/wxsqlite3.o
    /home/user/Downloads/Apps/guayadeque/guayadeque/Trunk/src/wxsqlite3/wxsqlite3.cpp: In member function ‘void wxSQLite3Database::SetCollation(const wxString&, wxSQLite3Collation*)’:
    /home/user/Downloads/Apps/guayadeque/guayadeque/Trunk/src/wxsqlite3/wxsqlite3.cpp:2475:7: warning: variable ‘rc’ set but not used [-Wunused-but-set-variable]
    int rc;
    ^
    Linking CXX executable guayadeque
    /usr/bin/ld: CMakeFiles/guayadeque.dir/iPodMedia.o: undefined reference to symbol 'gdk_pixbuf_save_to_buffer'
    /usr/bin/ld: note: 'gdk_pixbuf_save_to_buffer' is defined in DSO /lib64/libgdk_pixbuf-2.0.so.0 so try adding it to the linker command line
    /lib64/libgdk_pixbuf-2.0.so.0: could not read symbols: Invalid operation
    collect2: error: ld returned 1 exit status
    make[2]: *** [src/guayadeque] Error 1
    make[1]: *** [src/CMakeFiles/guayadeque.dir/all] Error 2
    make: *** [all] Error 2

    Thanks

Howdy, Stranger!

It looks like you're new here. If you want to get involved, click one of these buttons!

Sign In with OpenID